BDBM50376199 CHEMBL256697
SMILES NC(=S)NN=C(C(=O)c1ccccc1)c1ccccc1
InChI Key InChIKey=TVKDMYSDDLECSG-UHFFFAOYSA-N
Data  1 IC50
  Tab Delimited (TSV)   2D SDfile   Computed 3D by Vconf -m prep SDfile
Find this compound or compounds like it in BindingDB:
Activity Spreadsheet -- Enzyme Inhibition Constant Data from BindingDB
Found 1 hit for monomerid = 50376199
TargetPolyphenol oxidase 2(Agaricus bisporus (Common mushroom))
Sun Yat-Sen University
Curated by ChEMBL
LigandPNGBDBM50376199(CHEMBL256697)
Affinity DataIC50:  1.00E+5nM. Assay description: Inhibition of mushroom tyrosinase
In DepthDetails ArticlePubMed