BDBM50376210 CHEMBL257923
SMILES CC(=O)c1ccc(F)cc1
InChI Key InChIKey=ZDPAWHACYDRYIW-UHFFFAOYSA-N
Data  1 IC50
  Tab Delimited (TSV)   2D SDfile   Computed 3D by Vconf -m prep SDfile
Find this compound or compounds like it in BindingDB:
Activity Spreadsheet -- Enzyme Inhibition Constant Data from BindingDB
Found 1 hit for monomerid = 50376210
TargetPolyphenol oxidase 2(Agaricus bisporus (Common mushroom))
Sun Yat-Sen University
Curated by ChEMBL
LigandPNGBDBM50376210(CHEMBL257923)
Affinity DataIC50:  9.90E+5nM. Assay description: Inhibition of mushroom tyrosinase
In DepthDetails ArticlePubMed