BDBM50376327 CHEMBL410226
SMILES CCC1(CCCCN2CCC(=CC2)c2ccc(Cl)cc2)C(=O)Nc2ccccc12
InChI Key InChIKey=BEVYRGDFSYRITQ-UHFFFAOYSA-N
Data  1 KI
  Tab Delimited (TSV)   2D SDfile   Computed 3D by Vconf -m prep SDfile
Find this compound or compounds like it in BindingDB:
Activity Spreadsheet -- Enzyme Inhibition Constant Data from BindingDB
Found 1 hit for monomerid = 50376327
Target5-hydroxytryptamine receptor 7(Homo sapiens (Human))
Egis Pharmaceuticals
Curated by ChEMBL
LigandPNGBDBM50376327(CHEMBL410226)
Affinity DataKi:  1.02nM. Assay description: Displacement of [3H]LSD from human recombinant 5HT7 receptor expressed in CHO cells
In DepthDetails ArticlePubMed