BDBM50376358 CHEMBL259013
SMILES Nc1ncnc2NCCC(=Nc12)c1ccc(NC(=O)Nc2ccc(cc2)C(F)(F)F)cc1
InChI Key InChIKey=GACBELOLIOXYRT-UHFFFAOYSA-N
Data  4 IC50
  Tab Delimited (TSV)   2D SDfile   Computed 3D by Vconf -m prep SDfile
Find this compound or compounds like it in BindingDB:
Activity Spreadsheet -- Enzyme Inhibition Constant Data from BindingDB
Found 4 hits for monomerid = 50376358
TargetVascular endothelial growth factor receptor 2(Homo sapiens (Human))
Abbott Laboratories
Curated by ChEMBL
LigandPNGBDBM50376358(CHEMBL259013)
Affinity DataIC50:  110nM. Assay description: Inhibition of KDR in presence of 1 mM ATP
In DepthDetails ArticlePubMed
TargetVascular endothelial growth factor receptor 2(Mus musculus)
Abbott Laboratories
Curated by ChEMBL
LigandPNGBDBM50376358(CHEMBL259013)
Affinity DataIC50:  2.44E+3nM. Assay description: Inhibition of VEGF-induced KDR phosphorylation in mouse 3T3 cells
In DepthDetails ArticlePubMed
TargetMast/stem cell growth factor receptor Kit(Homo sapiens (Human))
Abbott Laboratories
Curated by ChEMBL
LigandPNGBDBM50376358(CHEMBL259013)
Affinity DataIC50:  35nM. Assay description: Inhibition of cKit
In DepthDetails ArticlePubMed
TargetReceptor-type tyrosine-protein kinase FLT3(Homo sapiens (Human))
Abbott Laboratories
Curated by ChEMBL
LigandPNGBDBM50376358(CHEMBL259013)
Affinity DataIC50:  9nM. Assay description: Inhibition of Flt3
In DepthDetails ArticlePubMed