BDBM50376435 CHEMBL261845
SMILES C[C@H](NC(=O)c1cn2ncnc(Nc3cc(NC(=O)c4cc(F)cc(c4)N4CCOCC4)ccc3C)c2c1C)c1ccccc1
InChI Key InChIKey=YOORUWXTIXHVGF-QHCPKHFHSA-N
Data  1 KI
  Tab Delimited (TSV)   2D SDfile   Computed 3D by Vconf -m prep SDfile
Find this compound or compounds like it in BindingDB:
Activity Spreadsheet -- Enzyme Inhibition Constant Data from BindingDB
Found 1 hit for monomerid = 50376435
TargetMitogen-activated protein kinase 14(Homo sapiens (Human))
Bristol-Myers Squibb
Curated by ChEMBL
LigandPNGBDBM50376435(CHEMBL261845)
Affinity DataKi:  0.540nM. Assay description: Inhibition of p38alpha
In DepthDetails ArticlePubMed