BDBM50376866 CHEMBL261067
SMILES NS(=O)(=O)c1ccc(cc1)N1N=C(CC1c1c[nH]c2cc(Br)ccc12)C(F)(F)F
InChI Key InChIKey=BFOQXQJHELRPCL-UHFFFAOYSA-N
Data  2 IC50
  Tab Delimited (TSV)   2D SDfile   Computed 3D by Vconf -m prep SDfile
Find this compound or compounds like it in BindingDB:
Activity Spreadsheet -- Enzyme Inhibition Constant Data from BindingDB
Found 2 hits for monomerid = 50376866
TargetProstaglandin G/H synthase 2(Ovis aries (Sheep))
Temple University School Of Medicine
Curated by ChEMBL
LigandPNGBDBM50376866(CHEMBL261067)
Affinity DataIC50:  4.40E+3nM. Assay description: Inhibition of ovine COX2 by enzyme immuno assay
In DepthDetails ArticlePubMed
TargetProstaglandin G/H synthase 1(Ovis aries (Sheep))
Temple University School Of Medicine
Curated by ChEMBL
LigandPNGBDBM50376866(CHEMBL261067)
Affinity DataIC50: >1.00E+5nM. Assay description: Inhibition of ovine COX1 by enzyme immuno assay
In DepthDetails ArticlePubMed