BDBM50376868 CHEMBL261429
SMILES NS(=O)(=O)c1ccc(cc1)N1N=C(CC1c1c[nH]c2c(Cl)cccc12)C(F)(F)F
InChI Key InChIKey=NDGPUMDPTVGJCG-UHFFFAOYSA-N
Data  6 IC50
  Tab Delimited (TSV)   2D SDfile   Computed 3D by Vconf -m prep SDfile
Find this compound or compounds like it in BindingDB:
Activity Spreadsheet -- Enzyme Inhibition Constant Data from BindingDB
Found 6 hits for monomerid = 50376868
TargetProstaglandin G/H synthase 1(Ovis aries (Sheep))
Temple University School Of Medicine
Curated by ChEMBL
LigandPNGBDBM50376868(CHEMBL261429)
Affinity DataIC50: >1.00E+5nM. Assay description: Inhibition of ovine COX1 by enzyme immuno assay
In DepthDetails ArticlePubMed
TargetProstaglandin G/H synthase 2(Ovis aries (Sheep))
Temple University School Of Medicine
Curated by ChEMBL
LigandPNGBDBM50376868(CHEMBL261429)
Affinity DataIC50:  3.90E+3nM. Assay description: Inhibition of ovine COX2 by enzyme immuno assay
In DepthDetails ArticlePubMed
TargetProstaglandin G/H synthase 1(Ovis aries (Sheep))
Temple University School Of Medicine
Curated by ChEMBL
LigandPNGBDBM50376868(CHEMBL261429)
Affinity DataIC50: >1.00E+5nM. Assay description: Inhibition of ovine COX1 by enzyme immuno assay
In DepthDetails ArticlePubMed
TargetProstaglandin G/H synthase 2(Ovis aries (Sheep))
Temple University School Of Medicine
Curated by ChEMBL
LigandPNGBDBM50376868(CHEMBL261429)
Affinity DataIC50:  3.90E+3nM. Assay description: Inhibition of ovine COX2 by enzyme immuno assay
In DepthDetails ArticlePubMed
TargetProstaglandin G/H synthase 2(Ovis aries (Sheep))
Temple University School Of Medicine
Curated by ChEMBL
LigandPNGBDBM50376868(CHEMBL261429)
Affinity DataIC50:  8.40E+4nM. Assay description: Inhibition of ovine COX2 by enzyme immuno assay
In DepthDetails ArticlePubMed
TargetProstaglandin G/H synthase 1(Ovis aries (Sheep))
Temple University School Of Medicine
Curated by ChEMBL
LigandPNGBDBM50376868(CHEMBL261429)
Affinity DataIC50: >1.00E+5nM. Assay description: Inhibition of ovine COX1 by enzyme immuno assay
In DepthDetails ArticlePubMed