BDBM50376884 CHEMBL429690
SMILES CCNC(=O)Nc1ccc(cc1)-c1nc2n(Cc3c(F)cccc3F)ccc(=O)n2c1CN(CC(=O)NCC(=O)N1CCC[C@H]1C(=O)NCC#Cc1ccccc1C#CCNC(=O)[C@@H]1CCCN1C(=O)CNC(=O)CN(Cc1c(nc2n(Cc3c(F)cccc3F)cc(C(=O)OCC)c(=O)n12)-c1ccc(NC(=O)NCC)cc1)Cc1ccccc1)Cc1ccccc1
InChI Key InChIKey=HQQMURRUPQFHPZ-KAUZTFBMSA-N
Data  1 KI
  Tab Delimited (TSV)   2D SDfile   Computed 3D by Vconf -m prep SDfile
Find this compound or compounds like it in BindingDB:
Activity Spreadsheet -- Enzyme Inhibition Constant Data from BindingDB
Found 1 hit for monomerid = 50376884
TargetGonadotropin-releasing hormone receptor(Homo sapiens (Human))
Leiden University
Curated by ChEMBL
LigandPNGBDBM50376884(CHEMBL429690)
Affinity DataKi:  850nM. Assay description: Displacement of [125I]triptorelin from human GnRHR expressed in CHO cells
In DepthDetails ArticlePubMed