BDBM50376896 CHEMBL262599
SMILES CCNC(=O)Nc1ccc(cc1)-c1nc2n(Cc3c(F)cccc3F)cc(C(=O)OCC)c(=O)n2c1CN(CC(=O)NCC(=O)NCC#Cc1ccc(cc1)C#CCNC(=O)CNC(=O)CN(Cc1c(nc2n(Cc3c(F)cccc3F)cc(C(=O)OCC)c(=O)n12)-c1ccc(NC(=O)NCC)cc1)Cc1ccccc1)Cc1ccccc1
InChI Key InChIKey=GXBWSZYKDPKWCZ-UHFFFAOYSA-N
Data  1 KI
  Tab Delimited (TSV)   2D SDfile   Computed 3D by Vconf -m prep SDfile
Find this compound or compounds like it in BindingDB:
Activity Spreadsheet -- Enzyme Inhibition Constant Data from BindingDB
Found 1 hit for monomerid = 50376896
TargetGonadotropin-releasing hormone receptor(Homo sapiens (Human))
Leiden University
Curated by ChEMBL
LigandPNGBDBM50376896(CHEMBL262599)
Affinity DataKi:  530nM. Assay description: Displacement of [125I]triptorelin from human GnRHR expressed in CHO cells
In DepthDetails ArticlePubMed