BDBM50376938 CHEMBL428086
SMILES CCCn1c(=O)n(CC)c2nc([nH]c2c1=O)-c1cnn(Cc2nc(no2)-c2ccc(Cl)cc2)c1
InChI Key InChIKey=HEHWDTREEVPBPD-UHFFFAOYSA-N
Data  4 KI
  Tab Delimited (TSV)   2D SDfile   Computed 3D by Vconf -m prep SDfile
Find this compound or compounds like it in BindingDB:
Activity Spreadsheet -- Enzyme Inhibition Constant Data from BindingDB
Found 4 hits for monomerid = 50376938
TargetAdenosine receptor A2b(Homo sapiens (Human))
Cv Therapeutics
Curated by ChEMBL
LigandPNGBDBM50376938(CHEMBL428086)
Affinity DataKi:  16nM. Assay description: Displacement of [3H]ZM-241385 from human recombinant adenosine A2B receptor expressed in HEK293 cells
In DepthDetails ArticlePubMed
TargetAdenosine receptor A3(Homo sapiens (Human))
Cv Therapeutics
Curated by ChEMBL
LigandPNGBDBM50376938(CHEMBL428086)
Affinity DataKi:  413nM. Assay description: Displacement of [125I]ABMECA from human recombinant adenosine A3 receptor expressed in CHO cells
In DepthDetails ArticlePubMed
TargetAdenosine receptor A1(Homo sapiens (Human))
Cv Therapeutics
Curated by ChEMBL
LigandPNGBDBM50376938(CHEMBL428086)
Affinity DataKi:  910nM. Assay description: Displacement of [3H]CPX from human recombinant adenosine A1 receptor expressed in CHO cells
In DepthDetails ArticlePubMed
TargetAdenosine receptor A2a(Homo sapiens (Human))
Cv Therapeutics
Curated by ChEMBL
LigandPNGBDBM50376938(CHEMBL428086)
Affinity DataKi:  3.78E+3nM. Assay description: Displacement of [3H]ZM-241385 from human recombinant adenosine A2A receptor expressed in HEK293 cells
In DepthDetails ArticlePubMed