BDBM50377448 CHEMBL405234
SMILES OCCNc1nc(C(=O)c2cccs2)c2sccc2n1
InChI Key InChIKey=PGCHQXADUKRVDJ-UHFFFAOYSA-N
Data  2 KI
  Tab Delimited (TSV)   2D SDfile   Computed 3D by Vconf -m prep SDfile
Find this compound or compounds like it in BindingDB:
Activity Spreadsheet -- Enzyme Inhibition Constant Data from BindingDB
Found 2 hits for monomerid = 50377448
TargetAdenosine receptor A2a(Homo sapiens (Human))
Vernalis (R&D)
Curated by ChEMBL
LigandPNGBDBM50377448(CHEMBL405234)
Affinity DataKi:  4.30nM. Assay description: Binding affinity to human adenosine A2A receptor
In DepthDetails ArticlePubMed
TargetAdenosine receptor A1(Homo sapiens (Human))
Vernalis (R&D)
Curated by ChEMBL
LigandPNGBDBM50377448(CHEMBL405234)
Affinity DataKi:  14nM. Assay description: Binding affinity to human adenosine A1 receptor
In DepthDetails ArticlePubMed