BDBM50377449 CHEMBL264433
SMILES O=C(c1cccs1)c1nc(NCc2ccccc2)nc2ccsc12
InChI Key InChIKey=VAKBAVCRGSQHSJ-UHFFFAOYSA-N
Data  2 KI
  Tab Delimited (TSV)   2D SDfile   Computed 3D by Vconf -m prep SDfile
Find this compound or compounds like it in BindingDB:
Activity Spreadsheet -- Enzyme Inhibition Constant Data from BindingDB
Found 2 hits for monomerid = 50377449
TargetAdenosine receptor A2a(Homo sapiens (Human))
Vernalis (R&D)
Curated by ChEMBL
LigandPNGBDBM50377449(CHEMBL264433)
Affinity DataKi:  25nM. Assay description: Binding affinity to human adenosine A2A receptor
In DepthDetails ArticlePubMed
TargetAdenosine receptor A1(Homo sapiens (Human))
Vernalis (R&D)
Curated by ChEMBL
LigandPNGBDBM50377449(CHEMBL264433)
Affinity DataKi:  1.73E+3nM. Assay description: Binding affinity to human adenosine A1 receptor
In DepthDetails ArticlePubMed