BDBM50377520 CHEMBL256151
SMILES Cn1ccnc1-c1nc(N)nc2n(Cc3ccccc3F)ncc12
InChI Key InChIKey=KYXOBFWXGDFNOK-UHFFFAOYSA-N
Data  2 KI
  Tab Delimited (TSV)   2D SDfile   Computed 3D by Vconf -m prep SDfile
Find this compound or compounds like it in BindingDB:
Activity Spreadsheet -- Enzyme Inhibition Constant Data from BindingDB
Found 2 hits for monomerid = 50377520
TargetAdenosine receptor A2a(Homo sapiens (Human))
Vernalis (R&D)
Curated by ChEMBL
LigandPNGBDBM50377520(CHEMBL256151)
Affinity DataKi:  1.62E+3nM. Assay description: Binding affinity at human adenosine A2A receptor
In DepthDetails ArticlePubMed
TargetAdenosine receptor A1(Homo sapiens (Human))
Vernalis (R&D)
Curated by ChEMBL
LigandPNGBDBM50377520(CHEMBL256151)
Affinity DataKi:  6.22E+3nM. Assay description: Binding affinity at human adenosine A1 receptor
In DepthDetails ArticlePubMed