BDBM50377852 CHEMBL261655
SMILES COc1cccc(CN2C[C@H](NC2=O)C(=O)N[C@@H](Cc2ccccc2)[C@H](O)CNCc2cccc(c2)N(C)C)c1
InChI Key InChIKey=MCBWJRZWLSXSBN-YTCPBCGMSA-N
Data  2 KI  1 IC50
PDB links: 1 PDB ID matches this monomer.
  Tab Delimited (TSV)   2D SDfile   Computed 3D by Vconf -m prep SDfile
Find this compound or compounds like it in BindingDB:
Activity Spreadsheet -- Enzyme Inhibition Constant Data from BindingDB
Found 3 hits for monomerid = 50377852
TargetCathepsin D(Homo sapiens (Human))
Lg Life Sciences
Curated by ChEMBL
LigandPNGBDBM50377852(CHEMBL261655)
Affinity DataKi:  195nM. Assay description: Inhibition of cathepsin D
In DepthDetails ArticlePubMed
TargetBeta-secretase 1(Homo sapiens (Human))
Lg Life Sciences
Curated by ChEMBL
LigandPNGBDBM50377852(CHEMBL261655)
Affinity DataKi:  449nM. Assay description: Inhibition of human BACE1
TargetBeta-secretase 1(Homo sapiens (Human))
Lg Life Sciences
Curated by ChEMBL
LigandPNGBDBM50377852(CHEMBL261655)
Affinity DataIC50:  1.42E+4nM. Assay description: Inhibition of human BACE1 by SEAP reporter gene assay