BDBM50377908 CACOSPONGIONOLIDE B
SMILES C[C@@H]1CC[C@@]2(C)[C@@H](CCCC2=C)[C@]1(C)CCC1=CCC(OC1)C1=CC(=O)OC1O
InChI Key InChIKey=CVAZWHZRZNYCOV-ILKJNQADSA-N
Data  4 IC50
  Tab Delimited (TSV)   2D SDfile   Computed 3D by Vconf -m prep SDfile
Find this compound or compounds like it in BindingDB:
Activity Spreadsheet -- Enzyme Inhibition Constant Data from BindingDB
Found 4 hits for monomerid = 50377908
TargetPhospholipase A2, membrane associated(Homo sapiens (Human))
Istituto Per La Chimica Di Molecole Di Interesse Biologico Cnr
Curated by ChEMBL
LigandPNGBDBM50377908(CACOSPONGIONOLIDE B)
Affinity DataIC50:  4.30E+3nM. Assay description: Inhibition of human synovial group2 sPLA2 by liquid scintillation counting
In DepthDetails ArticlePubMed
TargetPhospholipase A2(Apis mellifera)
Istituto Per La Chimica Di Molecole Di Interesse Biologico Cnr
Curated by ChEMBL
LigandPNGBDBM50377908(CACOSPONGIONOLIDE B)
Affinity DataIC50:  3.54E+4nM. Assay description: Inhibition of bee venom group3 sPLA2 at 10 uM by liquid scintillation counting
In DepthDetails ArticlePubMed
TargetPhospholipase A2, membrane associated(Rattus norvegicus)
Istituto Per La Chimica Di Molecole Di Interesse Biologico Cnr
Curated by ChEMBL
LigandPNGBDBM50377908(CACOSPONGIONOLIDE B)
Affinity DataIC50:  3.69E+4nM. Assay description: Inhibition of rat air pouch group2 sPLA2 at 10 uM by liquid scintillation counting
In DepthDetails ArticlePubMed
TargetPhospholipase A2, membrane associated(Homo sapiens (Human))
Istituto Per La Chimica Di Molecole Di Interesse Biologico Cnr
Curated by ChEMBL
LigandPNGBDBM50377908(CACOSPONGIONOLIDE B)
Affinity DataIC50:  8.67E+4nM. Assay description: Inhibition of human synovial group2 sPLA2 at 10 uM by liquid scintillation counting
In DepthDetails ArticlePubMed