BDBM50377942 LATIFOLIAN A
SMILES Oc1cc2C[C@@H]3c4cc(O)c(O)cc4C[C@H]4c5cc(O)c(O)cc5CC[N@@+]34c2cc1O
InChI Key InChIKey=PTYAOGZKZAVRNA-ATLLOTDBSA-O
Data  1 IC50
  Tab Delimited (TSV)   2D SDfile   Computed 3D by Vconf -m prep SDfile
Find this compound or compounds like it in BindingDB:
Activity Spreadsheet -- Enzyme Inhibition Constant Data from BindingDB
Found 1 hit for monomerid = 50377942
TargetMitogen-activated protein kinase 10(Homo sapiens (Human))
Griffith University
Curated by ChEMBL
LigandPNGBDBM50377942(LATIFOLIAN A)
Affinity DataIC50:  1.30E+4nM. Assay description: Inhibition of JNK3-induced transfer of [gamma33P]ATP to biotinylated ATF2 by scintillation proximity assay
In DepthDetails ArticlePubMed