BDBM50378127 CHEMBL574998
SMILES OP(O)(=O)OCCn1ccc(=O)[nH]c1=O
InChI Key InChIKey=DTVQZMXFZQIULD-UHFFFAOYSA-N
Data  1 IC50
  Tab Delimited (TSV)   2D SDfile   Computed 3D by Vconf -m prep SDfile
Find this compound or compounds like it in BindingDB:
Activity Spreadsheet -- Enzyme Inhibition Constant Data from BindingDB
Found 1 hit for monomerid = 50378127
TargetP2Y purinoceptor 2(Mus musculus)
University Of Bonn
Curated by ChEMBL
LigandPNGBDBM50378127(CHEMBL574998)
Affinity DataIC50: >5.00E+5nM. Assay description: Antagonist activity at mouse P2Y2 receptor expressed in NG108-15 hybrid cells assessed as inhibition of 1 uM UTP-induced intracellular calcium releas...
In DepthDetails ArticlePubMed