BDBM50378232 CHEMBL575928
SMILES CC(C)n1cnc2c(NCc3ccc(cc3)-c3cccc(Cl)c3)nc(N[C@H]3CC[C@H](N)CC3)nc12
InChI Key InChIKey=VBPWKBXFMRDVKN-YHBQERECSA-N
Data  2 IC50
  Tab Delimited (TSV)   2D SDfile   Computed 3D by Vconf -m prep SDfile
Find this compound or compounds like it in BindingDB:
Activity Spreadsheet -- Enzyme Inhibition Constant Data from BindingDB
Found 2 hits for monomerid = 50378232
LigandPNGBDBM50378232(CHEMBL575928)
Affinity DataIC50:  400nM. Assay description: Inhibition of recombinant CDK2/cyclin E
In DepthDetails ArticlePubMed
TargetCyclin-A1/Cyclin-A2/Cyclin-dependent kinase 2(Homo sapiens (Human))
Amri
Curated by ChEMBL
LigandPNGBDBM50378232(CHEMBL575928)
Affinity DataIC50:  400nM. Assay description: Inhibition of recombinant CDK2/cyclin A
In DepthDetails ArticlePubMed