BDBM50378279 CHEMBL582899
SMILES CC(C)[C@H](NC(=O)[C@@H](C)NC(=O)OCc1ccccc1)C(=O)NN(CC(N)=O)C(=O)C=CC(=O)N1CCCc2ccccc12
InChI Key InChIKey=XSTNOBYICDYADI-PIKZIKFNSA-N
Data  1 IC50
  Tab Delimited (TSV)   2D SDfile   Computed 3D by Vconf -m prep SDfile
Find this compound or compounds like it in BindingDB:
Activity Spreadsheet -- Enzyme Inhibition Constant Data from BindingDB
Found 1 hit for monomerid = 50378279
TargetLegumain(Ixodes ricinus)
Georgia Institute Of Technology
Curated by ChEMBL
LigandPNGBDBM50378279(CHEMBL582899)
Affinity DataIC50:  13nM. Assay description: Inhibition of Ixodes ricinus asparaginyl endopeptidases
In DepthDetails ArticlePubMed