BDBM50378742 CHEMBL1204062
SMILES C[C@H]1CN(C[C@@H](C)[C@]1(O)c1ccc(cc1)C(F)(F)F)C(=O)[C@@H]1CN(C[C@H]1c1ccc(F)cc1F)C(C)(C)C
InChI Key InChIKey=FLAHASYXGZSGHY-XYLBCIRHSA-N
Data  1 EC50
  Tab Delimited (TSV)   2D SDfile   Computed 3D by Vconf -m prep SDfile
Find this compound or compounds like it in BindingDB:
Activity Spreadsheet -- Enzyme Inhibition Constant Data from BindingDB
Found 1 hit for monomerid = 50378742
TargetMelanocortin receptor 4(Homo sapiens (Human))
Pfizer
Curated by ChEMBL
LigandPNGBDBM50378742(CHEMBL1204062)
Affinity DataEC50:  108nM. Assay description: Agonist activity at human recombinant MC4 receptor expressed in CHO cells by cAMP responsive beta lactamase reporter gene assay
In DepthDetails ArticlePubMed