BDBM50378762 CHEMBL1202339
SMILES On1cc(C2CCNCC2)c(n1)-c1ccc(cc1)-c1ccccc1
InChI Key InChIKey=CJAGXYNGXBAOBI-UHFFFAOYSA-N
Data  1 IC50
  Tab Delimited (TSV)   2D SDfile   Computed 3D by Vconf -m prep SDfile
Find this compound or compounds like it in BindingDB:
Activity Spreadsheet -- Enzyme Inhibition Constant Data from BindingDB
Found 1 hit for monomerid = 50378762
TargetGamma-aminobutyric acid receptor subunit alpha-1/beta-2/gamma-2(Homo sapiens (Human))
University Of Copenhagen
Curated by ChEMBL
LigandPNGBDBM50378762(CHEMBL1202339)
Affinity DataIC50:  1.40E+3nM. Assay description: Antagonist activity at human GABAA alpha-1-beta-2-gamma-2 receptor expressed in mouse tsA201 cells by FMP red assay
In DepthDetails ArticlePubMed