BDBM50378841 CHEMBL1258387
SMILES Cc1ccsc1CN=Nc1nc2ccccc2nc1Cc1ccccc1
InChI Key InChIKey=VSWWHAGBGAPURX-UHFFFAOYSA-N
Data  2 IC50
  Tab Delimited (TSV)   2D SDfile   Computed 3D by Vconf -m prep SDfile
Find this compound or compounds like it in BindingDB:
Activity Spreadsheet -- Enzyme Inhibition Constant Data from BindingDB
Found 2 hits for monomerid = 50378841
TargetAmine oxidase [flavin-containing] A(Homo sapiens (Human))
Alexandria University
Curated by ChEMBL
LigandPNGBDBM50378841(CHEMBL1258387)
Affinity DataIC50:  74nM. Assay description: Inhibition of MAOA by spectrophotometry
In DepthDetails ArticlePubMed
TargetAmine oxidase [flavin-containing] B(Homo sapiens (Human))
Alexandria University
Curated by ChEMBL
LigandPNGBDBM50378841(CHEMBL1258387)
Affinity DataIC50:  8.60E+5nM. Assay description: Inhibition of MAOB by spectrophotometry
In DepthDetails ArticlePubMed