BDBM50378900 CHEMBL1672415
SMILES CCc1c(C)c2cc3[nH]c(cc4nc([C@@H](CCC(=O)N(C)CCCCCCN(C)C(=O)c5cc6ccccc6c(n5)-c5ccccc5I)[C@@H]4C)c4cc(O)c5c(C)c(cc1[nH]2)nc45)c(C)c3C=C
InChI Key InChIKey=GSEUQQUYDQHBHC-WAYDFGFHSA-N
Data  1 IC50
  Tab Delimited (TSV)   2D SDfile   Computed 3D by Vconf -m prep SDfile
Find this compound or compounds like it in BindingDB:
Activity Spreadsheet -- Enzyme Inhibition Constant Data from BindingDB
Found 1 hit for monomerid = 50378900
TargetTranslocator protein(Homo sapiens (Human))
TBA
Curated by ChEMBL
LigandPNGBDBM50378900(CHEMBL1672415)
Affinity DataIC50:  210nM. Assay description: Displacement of [3H]-PK11195 from PBR after 1 hr by scintillation counting
In DepthDetails ArticlePubMed