BDBM50379183 CHEMBL1231350
SMILES OC(=O)c1cc2cc(O)ccc2cc1O
InChI Key InChIKey=QMWOUSYSNFCKAZ-UHFFFAOYSA-N
Data  1 IC50
PDB links: 2 PDB IDs match this monomer.
  Tab Delimited (TSV)   2D SDfile   Computed 3D by Vconf -m prep SDfile
Find this compound or compounds like it in BindingDB:
Activity Spreadsheet -- Enzyme Inhibition Constant Data from BindingDB
Found 1 hit for monomerid = 50379183
TargetProtein-tyrosine-phosphatase(Yersinia pestis)
Indiana University
Curated by ChEMBL
LigandPNGBDBM50379183(CHEMBL1231350)
Affinity DataIC50:  6.00E+4nM. Assay description: Inhibition of Yersinia pseudotuberculosis YopH
In DepthDetails ArticlePubMed