BDBM50379184 CHEMBL2010868
SMILES OC(=O)c1cc2cccc(O)c2cc1O
InChI Key InChIKey=YELLAPKUWRTITI-UHFFFAOYSA-N
Data  4 IC50  1 EC50
  Tab Delimited (TSV)   2D SDfile   Computed 3D by Vconf -m prep SDfile
Find this compound or compounds like it in BindingDB:
Activity Spreadsheet -- Enzyme Inhibition Constant Data from BindingDB
Found 5 hits for monomerid = 50379184
TargetProtein-tyrosine-phosphatase(Yersinia pestis)
Indiana University
Curated by ChEMBL
LigandPNGBDBM50379184(CHEMBL2010868)
Affinity DataIC50:  1.80E+4nM. Assay description: Inhibition of Yersinia pseudotuberculosis YopH
In DepthDetails ArticlePubMed
TargetGlutamate receptor ionotropic, NMDA 2D(Homo sapiens (Human))
University Of Bristol
Curated by ChEMBL
LigandPNGBDBM50379184(CHEMBL2010868)
Affinity DataEC50:  1.00E+4nM. Assay description: Positive allosteric modulation of GluN2D receptor (unknown origin) expressed in xenopus laevis oocytes assessed as increase in glycine-induced channe...
In DepthDetails ArticlePubMed
TargetGlutamate receptor ionotropic, NMDA 2C(Homo sapiens (Human))
University Of Bristol
Curated by ChEMBL
LigandPNGBDBM50379184(CHEMBL2010868)
Affinity DataIC50:  1.50E+4nM. Assay description: Negative allosteric modulation of GluN2C receptor (unknown origin) expressed in xenopus laevis oocytes assessed as reduction in glycine-induced chann...
In DepthDetails ArticlePubMed
Target1,3-beta-glucan synthase(Candida glabrata)
University Of Bristol
Curated by ChEMBL
LigandPNGBDBM50379184(CHEMBL2010868)
Affinity DataIC50:  9.70E+3nM. Assay description: Negative allosteric modulation of GluN2A receptor (unknown origin) expressed in xenopus laevis oocytes assessed as reduction in glycine-induced chann...
In DepthDetails ArticlePubMed
TargetGlutamate receptor ionotropic, NMDA 2B(Homo sapiens (Human))
University Of Bristol
Curated by ChEMBL
LigandPNGBDBM50379184(CHEMBL2010868)
Affinity DataIC50:  9.40E+3nM. Assay description: Negative allosteric modulation of GluN2B receptor (unknown origin) expressed in xenopus laevis oocytes assessed as reduction in glycine-induced chann...
In DepthDetails ArticlePubMed