BDBM50379303 CHEMBL2011804
SMILES Cc1ccccc1NC(=O)Nc1cccc(NC(=O)Nc2ccccc2C)c1
InChI Key InChIKey=QPRZJIMXMVWCAO-UHFFFAOYSA-N
Data  3 IC50
  Tab Delimited (TSV)   2D SDfile   Computed 3D by Vconf -m prep SDfile
Find this compound or compounds like it in BindingDB:
Activity Spreadsheet -- Enzyme Inhibition Constant Data from BindingDB
Found 3 hits for monomerid = 50379303
TargetATP-dependent RNA helicase DDX3X(Homo sapiens (Human))
University Of Siena
Curated by ChEMBL
LigandPNGBDBM50379303(CHEMBL2011804)
Affinity DataIC50:  1.70E+4nM. Assay description: Inhibition of human recombinant DDX3 ATPase activity expressed in Escherichia coli assessed as [gamma-32P] ATP hydrolysis after 5 mins by densitometr...
In DepthDetails ArticlePubMed
TargetATP-dependent RNA helicase DDX1(Homo sapiens (Human))
University Of Siena
Curated by ChEMBL
LigandPNGBDBM50379303(CHEMBL2011804)
Affinity DataIC50: >5.00E+5nM. Assay description: Inhibition of human recombinant DDX1 helicase activity expressed in Escherichia coli assessed as conversion of a 6-FAM-labeled double stranded RNA in...
In DepthDetails ArticlePubMed
TargetATP-dependent RNA helicase DDX3X(Homo sapiens (Human))
University Of Siena
Curated by ChEMBL
LigandPNGBDBM50379303(CHEMBL2011804)
Affinity DataIC50:  6.50E+4nM. Assay description: Inhibition of human recombinant DDX3 helicase activity expressed in Escherichia coli assessed as conversion of a 6-FAM-labeled double stranded RNA in...
In DepthDetails ArticlePubMed