BDBM50379415 CHEMBL2012029
SMILES Cc1ccc(Oc2ccc(Nc3nccc(N)n3)cc2)cc1
InChI Key InChIKey=QRJDTECPLGOOBM-UHFFFAOYSA-N
Data  1 KI  2 IC50
  Tab Delimited (TSV)   2D SDfile   Computed 3D by Vconf -m prep SDfile
Find this compound or compounds like it in BindingDB:
Activity Spreadsheet -- Enzyme Inhibition Constant Data from BindingDB
Found 3 hits for monomerid = 50379415
TargetPotassium voltage-gated channel subfamily H member 2(Homo sapiens (Human))
Amgen
Curated by ChEMBL
LigandPNGBDBM50379415(CHEMBL2012029)
Affinity DataKi:  1.10E+3nM. Assay description: Displacement of dofetilide from human ERG
In DepthDetails ArticlePubMed
TargetSodium channel protein type 5 subunit alpha(Homo sapiens (Human))
Amgen
Curated by ChEMBL
LigandPNGBDBM50379415(CHEMBL2012029)
Affinity DataIC50:  590nM. Assay description: Antagonist activity at human partially inactivated NaV 1.5 channel expressed in HEK293 cells by PatchXpress voltage patch clamp assay
In DepthDetails ArticlePubMed
TargetSodium channel protein type 9 subunit alpha(Homo sapiens (Human))
Amgen
Curated by ChEMBL
LigandPNGBDBM50379415(CHEMBL2012029)
Affinity DataIC50:  1.60E+3nM. Assay description: Antagonist activity at human partially inactivated NaV 1.7 channel expressed in HEK293 cells by PatchXpress voltage patch clamp assay
In DepthDetails ArticlePubMed