BDBM50379458 CHEMBL2012273
SMILES Fc1c(Cn2ccc3c(OC4CCN(Cc5cscn5)CC4)ncnc23)cccc1C(F)(F)F
InChI Key InChIKey=HAYGNNHVUSBUBN-UHFFFAOYSA-N
Data  1 KI  2 IC50
  Tab Delimited (TSV)   2D SDfile   Computed 3D by Vconf -m prep SDfile
Find this compound or compounds like it in BindingDB:
Activity Spreadsheet -- Enzyme Inhibition Constant Data from BindingDB
Found 3 hits for monomerid = 50379458
TargetPotassium voltage-gated channel subfamily H member 2(Homo sapiens (Human))
Amgen
Curated by ChEMBL
LigandPNGBDBM50379458(CHEMBL2012273)
Affinity DataKi:  300nM. Assay description: Displacement of dofetilide from human ERG
In DepthDetails ArticlePubMed
TargetSodium channel protein type 9 subunit alpha(Homo sapiens (Human))
Amgen
Curated by ChEMBL
LigandPNGBDBM50379458(CHEMBL2012273)
Affinity DataIC50:  30nM. Assay description: Antagonist activity at human NaV1.7 channel by patchXpress assay
In DepthDetails ArticlePubMed
TargetSodium channel protein type 5 subunit alpha(Homo sapiens (Human))
Amgen
Curated by ChEMBL
LigandPNGBDBM50379458(CHEMBL2012273)
Affinity DataIC50:  40nM. Assay description: Antagonist activity at human NaV1.5 channel by patchXpress assay
In DepthDetails ArticlePubMed