BDBM50379538 CHEMBL2012833
SMILES CC(C)C[C@H](NCCCC[C@@H](Cc1cc(C)c(F)c(C)c1)C(=O)NO)c1ccc(F)cc1
InChI Key InChIKey=IEAXISQFLAARMR-UPVQGACJSA-N
Data  1 KI
  Tab Delimited (TSV)   2D SDfile   Computed 3D by Vconf -m prep SDfile
Find this compound or compounds like it in BindingDB:
Activity Spreadsheet -- Enzyme Inhibition Constant Data from BindingDB
Found 1 hit for monomerid = 50379538
TargetLethal factor(Bacillus anthracis)
Panthera Biopharma
Curated by ChEMBL
LigandPNGBDBM50379538(CHEMBL2012833)
Affinity DataKi:  1.30nM. Assay description: Inhibition of N-terminal 6-histine tagged Bacillus anthracis LF 263-C terminal catalytic domain using MCA-KKVYPYPME-Dap(Dnp)-NH2 as substrate after 4...
In DepthDetails ArticlePubMed