BDBM50379718 CHEMBL2011127
SMILES CC(C)N1Cc2c(nc(nc2N(C)Cc2cc3ccccc3cn2)N2CCN(CC2)C(C)=O)C1=O
InChI Key InChIKey=NUCDMFSRNOBIBN-UHFFFAOYSA-N
Data  2 IC50
  Tab Delimited (TSV)   2D SDfile   Computed 3D by Vconf -m prep SDfile
Find this compound or compounds like it in BindingDB:
Activity Spreadsheet -- Enzyme Inhibition Constant Data from BindingDB
Found 2 hits for monomerid = 50379718
TargetCytochrome P450 2C9(Homo sapiens (Human))
Astrazeneca
Curated by ChEMBL
LigandPNGBDBM50379718(CHEMBL2011127)
Affinity DataIC50:  7.00E+3nM. Assay description: Inhibition of recombinant CYP2C9
In DepthDetails ArticlePubMed
TargetP2X purinoceptor 3(Homo sapiens (Human))
Astrazeneca
Curated by ChEMBL
LigandPNGBDBM50379718(CHEMBL2011127)
Affinity DataIC50:  22nM. Assay description: Antagonist activity at human P2X3 receptor expressed in RLE cells assessed as inhibition of (alpha,beta)me-ATP-induced intracellular calcium level by...
In DepthDetails ArticlePubMed