BDBM50379902 CHEMBL2011988
SMILES CN1C(N)=NC(C2CC2)(C1=O)c1cccc(c1)-c1cccc(Cl)c1
InChI Key InChIKey=BMNNJCHHHVKNJT-UHFFFAOYSA-N
Data  1 KI  1 IC50
  Tab Delimited (TSV)   2D SDfile   Computed 3D by Vconf -m prep SDfile
Find this compound or compounds like it in BindingDB:
Activity Spreadsheet -- Enzyme Inhibition Constant Data from BindingDB
Found 2 hits for monomerid = 50379902
TargetBeta-secretase 1(Homo sapiens (Human))
Merck Research Laboratories
Curated by ChEMBL
LigandPNGBDBM50379902(CHEMBL2011988)
Affinity DataKi:  47nM. Assay description: Inhibition of human BACE1 using QSY7EISEVNLDAEFC-Eu-amide as substrate incubated for 30 mins prior to substrate addition measured after 90 mins by FR...
In DepthDetails ArticlePubMed
TargetBeta-secretase 1(Homo sapiens (Human))
Merck Research Laboratories
Curated by ChEMBL
LigandPNGBDBM50379902(CHEMBL2011988)
Affinity DataIC50:  1.90E+3nM. Assay description: Inhibition of BACE1 in HEK293 cells expressing APP swedish and london mutant assessed as decrease of amyloid-beta40 level after 4 hrs by electrochemi...
In DepthDetails ArticlePubMed