BDBM50380186 CHEMBL2011202
SMILES Clc1ccc2c(c1)nc1\C(CCn1c2=O)=C\c1ccc(cc1)C(=O)NCCN1CCCC1
InChI Key InChIKey=PSOGAWHFIYVNRZ-XDJHFCHBSA-N
Data  2 IC50
  Tab Delimited (TSV)   2D SDfile   Computed 3D by Vconf -m prep SDfile
Find this compound or compounds like it in BindingDB:
Activity Spreadsheet -- Enzyme Inhibition Constant Data from BindingDB
Found 2 hits for monomerid = 50380186
TargetCholinesterase(Equus caballus (Horse))
Sun Yat-Sen University
Curated by ChEMBL
LigandPNGBDBM50380186(CHEMBL2011202)
Affinity DataIC50:  1.11E+4nM. Assay description: Inhibition of equine serum butyrylcholinesterase using butyrylthiocholine chloride as substrate preincubated for 15 mins before substrate addition by...
In DepthDetails ArticlePubMed
TargetAcetylcholinesterase(Electrophorus electricus (Electric eel))
Sun Yat-Sen University
Curated by ChEMBL
LigandPNGBDBM50380186(CHEMBL2011202)
Affinity DataIC50:  45nM. Assay description: Inhibition of electric eel acetylcholinesterase using acetylcholine chloride as substrate preincubated for 15 mins before substrate addition by Ellma...
In DepthDetails ArticlePubMed