BDBM50380224 CHEMBL189050
SMILES Cc1cc2[C@H]3CC[C@@]4(C)[C@@H](CCC4=O)[C@@H]3CCc2cc1OS(N)(=O)=O
InChI Key InChIKey=TWZULWIHTIHVRN-MVWRLGRASA-N
Data  1 IC50
  Tab Delimited (TSV)   2D SDfile   Computed 3D by Vconf -m prep SDfile
Find this compound or compounds like it in BindingDB:
Activity Spreadsheet -- Enzyme Inhibition Constant Data from BindingDB
Found 1 hit for monomerid = 50380224
TargetSteryl-sulfatase(Homo sapiens (Human))
University Of Bath
Curated by ChEMBL
LigandPNGBDBM50380224(CHEMBL189050)
Affinity DataIC50: >1.00E+4nM. Assay description: Inhibition of steroid sulfatase in human placental microsomes using [3H]E1S as substrate after 30 mins by scintillation spectrometry
In DepthDetails ArticlePubMed