BDBM50380330 CHEMBL2017801
SMILES Oc1ccc(cc1)C1NC(=O)C(C#N)=C(SCc2cccc(c2)N2CCOCC2)S1
InChI Key InChIKey=MKAYQYBWXUEFTI-UHFFFAOYSA-N
Data  1 IC50
  Tab Delimited (TSV)   2D SDfile   Computed 3D by Vconf -m prep SDfile
Find this compound or compounds like it in BindingDB:
Activity Spreadsheet -- Enzyme Inhibition Constant Data from BindingDB
Found 1 hit for monomerid = 50380330
TargetGalactokinase(Homo sapiens (Human))
TBA
Curated by ChEMBL
LigandPNGBDBM50380330(CHEMBL2017801)
Affinity DataIC50:  2.40E+3nM. Assay description: Inhibition of human galactokinase after 30 mins by Kinase-GloTM assay
In DepthDetails ArticlePubMed