BDBM50380523 CHEMBL2018909
SMILES COc1ccc2nc(SCC(C)C)[nH]c2c1
InChI Key InChIKey=ZEGLOXZHHNZQFC-UHFFFAOYSA-N
Data  1 KI  8 IC50
  Tab Delimited (TSV)   2D SDfile   Computed 3D by Vconf -m prep SDfile
Find this compound or compounds like it in BindingDB:
Activity Spreadsheet -- Enzyme Inhibition Constant Data from BindingDB
Found 9 hits for monomerid = 50380523
TargetCytochrome P450 2C19(Homo sapiens (Human))
Amgen
Curated by ChEMBL
LigandPNGBDBM50380523(CHEMBL2018909)
Affinity DataKi:  60nM. Assay description: Inhibition of recombinant CYP2C19 using 3-O-methylfluorescein as substrate preincubated for 3 mins
In DepthDetails ArticlePubMed
TargetCytochrome P450 3A4(Homo sapiens (Human))
Amgen
Curated by ChEMBL
LigandPNGBDBM50380523(CHEMBL2018909)
Affinity DataIC50:  5.00E+4nM. Assay description: Inhibition of CYP3A4 in human liver microsomes using midazolam as substrate preincubated for 5 mins by LC-MS/MS analysis
In DepthDetails ArticlePubMed
TargetCytochrome P450 2B6(Homo sapiens (Human))
Amgen
Curated by ChEMBL
LigandPNGBDBM50380523(CHEMBL2018909)
Affinity DataIC50:  5.00E+4nM. Assay description: Inhibition of CYP2B6 in human liver microsomes using bupropion as substrate preincubated for 5 mins by LC-MS/MS analysis
In DepthDetails ArticlePubMed
TargetCytochrome P450 2C19(Homo sapiens (Human))
Amgen
Curated by ChEMBL
LigandPNGBDBM50380523(CHEMBL2018909)
Affinity DataIC50:  5.00E+4nM. Assay description: Inhibition of CYP2C19 in human liver microsomes using (S)-mpheytoin as substrate preincubated for 5 mins by LC-MS/MS analysis
In DepthDetails ArticlePubMed
TargetCytochrome P450 2D6(Homo sapiens (Human))
Amgen
Curated by ChEMBL
LigandPNGBDBM50380523(CHEMBL2018909)
Affinity DataIC50:  1.16E+4nM. Assay description: Inhibition of CYP2D6 in human liver microsomes using dextromethorphan as substrate preincubated for 5 mins by LC-MS/MS analysis
In DepthDetails ArticlePubMed
TargetCytochrome P450 2C9(Homo sapiens (Human))
Amgen
Curated by ChEMBL
LigandPNGBDBM50380523(CHEMBL2018909)
Affinity DataIC50:  3.27E+4nM. Assay description: Inhibition of CYP2C9 in human liver microsomes using diclofenac as substrate preincubated for 5 mins by LC-MS/MS analysis
In DepthDetails ArticlePubMed
TargetCytochrome P450 1A2(Homo sapiens (Human))
Amgen
Curated by ChEMBL
LigandPNGBDBM50380523(CHEMBL2018909)
Affinity DataIC50:  1.02E+3nM. Assay description: Inhibition of CYP1A2 in human liver microsomes using phenacetin preincubated for 5 mins by LC-MS/MS analysis
In DepthDetails ArticlePubMed
TargetCytochrome P450 2E1(Homo sapiens (Human))
Amgen
Curated by ChEMBL
LigandPNGBDBM50380523(CHEMBL2018909)
Affinity DataIC50:  5.00E+4nM. Assay description: Inhibition of CYP2E1 in human liver microsomes using chlorzoxazone as substrate preincubated for 5 mins by LC-MS/MS analysis
In DepthDetails ArticlePubMed
TargetCytochrome P450 2C8(Homo sapiens (Human))
Amgen
Curated by ChEMBL
LigandPNGBDBM50380523(CHEMBL2018909)
Affinity DataIC50:  3.19E+4nM. Assay description: Inhibition of CYP2C8 in human liver microsomes using paclitaxel as substrate preincubated for 5 mins by LC-MS/MS analysis
In DepthDetails ArticlePubMed