BDBM50380556 CHEMBL2019051
SMILES Oc1cc(O)c2c(c1)oc(cc2=O)C(=O)NCCCCCCCCCCNc1c2CCCCc2nc2cc(Cl)cc(Cl)c12
InChI Key InChIKey=AWEIPXRUFDVNHO-UHFFFAOYSA-N
Data  2 IC50
  Tab Delimited (TSV)   2D SDfile   Computed 3D by Vconf -m prep SDfile
Find this compound or compounds like it in BindingDB:
Activity Spreadsheet -- Enzyme Inhibition Constant Data from BindingDB
Found 2 hits for monomerid = 50380556
TargetAcetylcholinesterase(Bos taurus (bovine))
Instituto De Qu£Mica M£Dica
Curated by ChEMBL
LigandPNGBDBM50380556(CHEMBL2019051)
Affinity DataIC50:  75nM. Assay description: Inhibition of bovine erythrocytes AChE by Ellman's method
In DepthDetails ArticlePubMed
TargetCholinesterase(Equus caballus (Horse))
Instituto De Qu£Mica M£Dica
Curated by ChEMBL
LigandPNGBDBM50380556(CHEMBL2019051)
Affinity DataIC50:  35nM. Assay description: Inhibition of horse serum BChE by Ellman's method
In DepthDetails ArticlePubMed