BDBM50380631 CHEMBL2017070
SMILES COc1cc2CCn3cnc(-c4cocn4)c3-c2cc1OC
InChI Key InChIKey=SVRMHFXMIQWERK-UHFFFAOYSA-N
Data  1 KI
  Tab Delimited (TSV)   2D SDfile   Computed 3D by Vconf -m prep SDfile
Find this compound or compounds like it in BindingDB:
Activity Spreadsheet -- Enzyme Inhibition Constant Data from BindingDB
Found 1 hit for monomerid = 50380631
TargetcAMP and cAMP-inhibited cGMP 3',5'-cyclic phosphodiesterase 10A(Homo sapiens (Human))
Merck Research Laboratories
Curated by ChEMBL
LigandPNGBDBM50380631(CHEMBL2017070)
Affinity DataKi:  508nM. Assay description: Inhibition of human recombinant PDE10A assessed as inhibition of [3H]cAMP hydrolysis by scintillation proximity assay
In DepthDetails ArticlePubMed