BDBM50380683 CHEMBL2017507
SMILES CCOP(=O)(OCC)C(Cc1ccccc1)c1sc2ccccc2c1C
InChI Key InChIKey=VZXCBYCDPRUZAN-UHFFFAOYSA-N
Data  1 IC50
  Tab Delimited (TSV)   2D SDfile   Computed 3D by Vconf -m prep SDfile
Find this compound or compounds like it in BindingDB:
Activity Spreadsheet -- Enzyme Inhibition Constant Data from BindingDB
Found 1 hit for monomerid = 50380683
TargetTransient receptor potential M8 protein(Canis lupus familiaris (Dog))
Janssen Pharmaceutica
Curated by ChEMBL
LigandPNGBDBM50380683(CHEMBL2017507)
Affinity DataIC50:  360nM. Assay description: Antagonist activity at dog TRPM8 expressed in HEK293 cells assessed as inhibition of icilin-induced increase in intracellular Ca2+ level measured eve...
In DepthDetails ArticlePubMed