BDBM50380690 CHEMBL2017505
SMILES CCOP(=O)(OCC)C(Cc1ccc(F)cc1)c1sc2ccccc2c1C
InChI Key InChIKey=JUDDQMDPLTZDIH-UHFFFAOYSA-N
Data  1 IC50
  Tab Delimited (TSV)   2D SDfile   Computed 3D by Vconf -m prep SDfile
Find this compound or compounds like it in BindingDB:
Activity Spreadsheet -- Enzyme Inhibition Constant Data from BindingDB
Found 1 hit for monomerid = 50380690
TargetTransient receptor potential M8 protein(Canis lupus familiaris (Dog))
Janssen Pharmaceutica
Curated by ChEMBL
LigandPNGBDBM50380690(CHEMBL2017505)
Affinity DataIC50:  184nM. Assay description: Antagonist activity at dog TRPM8 expressed in HEK293 cells assessed as inhibition of icilin-induced increase in intracellular Ca2+ level measured eve...
In DepthDetails ArticlePubMed