BDBM50381018 CHEMBL2017135
SMILES CCCCCCCC\C=C/CCCCCCCC(=O)OCC(COP(O)(O)=O)OC
InChI Key InChIKey=ZEJUBLZWLYUKSE-KHPPLWFESA-N
Data  1 IC50
  Tab Delimited (TSV)   2D SDfile   Computed 3D by Vconf -m prep SDfile
Find this compound or compounds like it in BindingDB:
Activity Spreadsheet -- Enzyme Inhibition Constant Data from BindingDB
Found 1 hit for monomerid = 50381018
TargetEctonucleotide pyrophosphatase/phosphodiesterase family member 2(Homo sapiens (Human))
Technical University Of Lodz
Curated by ChEMBL
LigandPNGBDBM50381018(CHEMBL2017135)
Affinity DataIC50:  220nM. Assay description: Inhibition of human recombinant autotaxin expressed in insect Sf9 cells using FS-3 as substrate preincubated for 10 mins prior substrate addition mea...
In DepthDetails ArticlePubMed