BDBM50381030 CHEMBL2017145
SMILES Oc1ccc2CC34C[C@@H](CCC3(CCN(CC3CC3)C4)c2c1)C(=O)Nc1ccccc1
InChI Key InChIKey=YLMCBOPBZSKALW-QJYLRPAKSA-N
Data  3 KI
  Tab Delimited (TSV)   2D SDfile   Computed 3D by Vconf -m prep SDfile
Find this compound or compounds like it in BindingDB:
Activity Spreadsheet -- Enzyme Inhibition Constant Data from BindingDB
Found 3 hits for monomerid = 50381030
TargetKappa-type opioid receptor(Cavia porcellus (domestic guinea pig))
Kitasato University
Curated by ChEMBL
LigandPNGBDBM50381030(CHEMBL2017145)
Affinity DataKi:  13.4nM. Assay description: Displacement of [3H]U69593 from kappa opioid receptor in guinea pig cerebellum
In DepthDetails ArticlePubMed
TargetMu-type opioid receptor(MOUSE)
Kitasato University
Curated by ChEMBL
LigandPNGBDBM50381030(CHEMBL2017145)
Affinity DataKi:  79.7nM. Assay description: Displacement of [3H]DAMGO from mu opioid receptor in mouse whole brain without cerebellum
In DepthDetails ArticlePubMed
TargetMu-type opioid receptor(MOUSE)
Kitasato University
Curated by ChEMBL
LigandPNGBDBM50381030(CHEMBL2017145)
Affinity DataKi:  282nM. Assay description: Displacement of [3H]DPDPE from delta opioid receptor in mouse whole brain without cerebellum
In DepthDetails ArticlePubMed