BDBM50381129 CHEMBL2017730
SMILES CN1CCC(CNc2cc(Nc3cc(n[nH]3)C3CC3)nc(n2)-c2ccccc2)CC1
InChI Key InChIKey=FCNWQYLAHXYKOI-UHFFFAOYSA-N
Data  1 IC50
  Tab Delimited (TSV)   2D SDfile   Computed 3D by Vconf -m prep SDfile
Find this compound or compounds like it in BindingDB:
Activity Spreadsheet -- Enzyme Inhibition Constant Data from BindingDB
Found 1 hit for monomerid = 50381129
TargetSerine/threonine-protein kinase PknB(Mycobacterium tuberculosis)
Mrc Technology
Curated by ChEMBL
LigandPNGBDBM50381129(CHEMBL2017730)
Affinity DataIC50:  55nM. Assay description: Inhibition of Mycobacterium tuberculosis GST-fused PknB expressed in Escherichia coli assessed as GarA substrate phosphorylation after 30 mins
In DepthDetails ArticlePubMed