BDBM50381246 CHEMBL2018567
SMILES Cc1noc2c(Cc3ccc(cc3)[N+]([O-])=O)nn(Cc3nnc(Nc4ccccc4)s3)c(=O)c12
InChI Key InChIKey=RHRCRBLQCAWGCP-UHFFFAOYSA-N
Data  2 IC50
  Tab Delimited (TSV)   2D SDfile   Computed 3D by Vconf -m prep SDfile
Find this compound or compounds like it in BindingDB:
Activity Spreadsheet -- Enzyme Inhibition Constant Data from BindingDB
Found 2 hits for monomerid = 50381246
TargetProstaglandin G/H synthase 2(Homo sapiens (Human))
University Of Hacettepe
Curated by ChEMBL
LigandPNGBDBM50381246(CHEMBL2018567)
Affinity DataIC50: >1.00E+5nM. Assay description: Inhibition of human recombinant COX2 by fluorescence assay
In DepthDetails ArticlePubMed
TargetProstaglandin G/H synthase 1(Ovis aries (Sheep))
University Of Hacettepe
Curated by ChEMBL
LigandPNGBDBM50381246(CHEMBL2018567)
Affinity DataIC50:  7.74E+4nM. Assay description: Inhibition of ovine COX1 by fluorescence assay
In DepthDetails ArticlePubMed