BDBM50381780 CHEMBL2023452
SMILES Cc1c(cnn1-c1ccccc1)-c1ccnc2ccccc12
InChI Key InChIKey=AITBHINBCNTNCN-UHFFFAOYSA-N
Data  1 EC50
  Tab Delimited (TSV)   2D SDfile   Computed 3D by Vconf -m prep SDfile
Find this compound or compounds like it in BindingDB:
Activity Spreadsheet -- Enzyme Inhibition Constant Data from BindingDB
Found 1 hit for monomerid = 50381780
TargetMetabotropic glutamate receptor 4(Homo sapiens (Human))
Lundbeck Research Usa
Curated by ChEMBL
LigandPNGBDBM50381780(CHEMBL2023452)
Affinity DataEC50:  670nM. Assay description: Positive allosteric modulation of human mGlu4 receptor expressed in BHK cells assessed as potentiation of glutamate-induced calcium mobilization by F...
In DepthDetails ArticlePubMed