BDBM50381954 CHEMBL2022934
SMILES Nc1c2CN(CC#C)CCc2nc2nc(N3CCCCC3)c(cc12)C#N
InChI Key InChIKey=UQPSZGFXWACLJE-UHFFFAOYSA-N
Data  4 IC50
  Tab Delimited (TSV)   2D SDfile   Computed 3D by Vconf -m prep SDfile
Find this compound or compounds like it in BindingDB:
Activity Spreadsheet -- Enzyme Inhibition Constant Data from BindingDB
Found 4 hits for monomerid = 50381954
TargetAmine oxidase [flavin-containing] B(Rattus norvegicus (rat))
Laboratorio De Radicales Libres Y Qu�Mica Computacional (Iqog, Csic)
Curated by ChEMBL
LigandPNGBDBM50381954(CHEMBL2022934)
Affinity DataIC50:  2.96E+5nM. Assay description: Inhibition of mitochondrial MAO-B in rat liver homogenates using [14C]-phenylethylamine as substrate preincubated for 30 mins by liquid scintillation...
In DepthDetails ArticlePubMed
TargetAmine oxidase [flavin-containing] A(Rattus norvegicus (rat))
Laboratorio De Radicales Libres Y Qu�Mica Computacional (Iqog, Csic)
Curated by ChEMBL
LigandPNGBDBM50381954(CHEMBL2022934)
Affinity DataIC50:  3.30E+5nM. Assay description: Inhibition of mitochondrial MAO-A in rat liver homogenates using [14C]-(5-hydroxy-triptamine) as substrate preincubated for 30 mins by liquid scintil...
In DepthDetails ArticlePubMed
TargetCarboxylic ester hydrolase(Equus caballus (Horse))
Laboratorio De Radicales Libres Y Qu�Mica Computacional (Iqog, Csic)
Curated by ChEMBL
LigandPNGBDBM50381954(CHEMBL2022934)
Affinity DataIC50:  1.00E+4nM. Assay description: Inhibition of equine serum BChE using butyrylthiocholine iodide as substrate after 15 mins by Ellman's method
In DepthDetails ArticlePubMed
TargetAcetylcholinesterase(Electrophorus electricus (Electric eel))
Laboratorio De Radicales Libres Y Qu�Mica Computacional (Iqog, Csic)
Curated by ChEMBL
LigandPNGBDBM50381954(CHEMBL2022934)
Affinity DataIC50:  66nM. Assay description: Inhibition of electric eel AChE using acetylthiocholine iodide as substrate after 15 mins by Ellman's method
In DepthDetails ArticlePubMed