BDBM50382033 CHEMBL2022378
SMILES CC1CCCN(Cc2cc(Nc3nc(C)cn4c(cnc34)-c3cnn(CC(=O)Nc4cccnc4)c3)sn2)C1
InChI Key InChIKey=JISRCHCXKMPPJP-UHFFFAOYSA-N
Data  2 IC50
  Tab Delimited (TSV)   2D SDfile   Computed 3D by Vconf -m prep SDfile
Find this compound or compounds like it in BindingDB:
Activity Spreadsheet -- Enzyme Inhibition Constant Data from BindingDB
Found 2 hits for monomerid = 50382033
TargetAurora kinase A(Homo sapiens (Human))
Amri
Curated by ChEMBL
LigandPNGBDBM50382033(CHEMBL2022378)
Affinity DataIC50:  186nM. Assay description: Inhibition of aurora A kinase using 5TAMRA-GRTGRRNSICOOH as substrate by fluorescent assay
In DepthDetails ArticlePubMed
TargetAurora kinase B(Homo sapiens (Human))
Amri
Curated by ChEMBL
LigandPNGBDBM50382033(CHEMBL2022378)
Affinity DataIC50:  118nM. Assay description: Inhibition of aurora B kinase using 5TAMRA-GRTGRRNSICOOH as substrate by fluorescent assay
In DepthDetails ArticlePubMed