BDBM50382045 CHEMBL2022736
SMILES COc1cc(NC(=O)c2ccccc2F)ccc1-c1nnc(NCCCCN2CCCCC2)o1
InChI Key InChIKey=LWZACJZVDHZBCL-UHFFFAOYSA-N
Data  1 IC50  1 EC50
  Tab Delimited (TSV)   2D SDfile   Computed 3D by Vconf -m prep SDfile
Find this compound or compounds like it in BindingDB:
Activity Spreadsheet -- Enzyme Inhibition Constant Data from BindingDB
Found 2 hits for monomerid = 50382045
TargetPotassium voltage-gated channel subfamily H member 2(Homo sapiens (Human))
Glaxosmithkline
Curated by ChEMBL
LigandPNGBDBM50382045(CHEMBL2022736)
Affinity DataIC50:  1.58E+4nM. Assay description: Displacement of [3H]Dofetilide from human ERG expressed in CHO-K1 cells by scintillation proximity assay
In DepthDetails ArticlePubMed
TargetNeuronal acetylcholine receptor subunit alpha-7(Homo sapiens (Human))
Glaxosmithkline
Curated by ChEMBL
LigandPNGBDBM50382045(CHEMBL2022736)
Affinity DataEC50:  19.9nM. Assay description: Agonist activity at human alpha7 nAChR expressed in GH4C1 cells by FLIPR assay
In DepthDetails ArticlePubMed