BDBM50382326 CHEMBL2024692
SMILES CCn1cnc2ccc(cc2c1=O)-c1ccnn1-c1cccc(C)n1
InChI Key InChIKey=SVYUNLDRUFJWNV-UHFFFAOYSA-N
Data  2 IC50
  Tab Delimited (TSV)   2D SDfile   Computed 3D by Vconf -m prep SDfile
Find this compound or compounds like it in BindingDB:
Activity Spreadsheet -- Enzyme Inhibition Constant Data from BindingDB
Found 2 hits for monomerid = 50382326
TargetTGF-beta receptor type-1(Homo sapiens (Human))
Pfizer
Curated by ChEMBL
LigandPNGBDBM50382326(CHEMBL2024692)
Affinity DataIC50:  69nM. Assay description: Inhibition of ALK5
In DepthDetails ArticlePubMed
TargetTGF-beta receptor type-1(Mus musculus)
Pfizer
Curated by ChEMBL
LigandPNGBDBM50382326(CHEMBL2024692)
Affinity DataIC50:  708nM. Assay description: Inhibition of ALK5 in mouse NIH/3T3 cells by smad binding element reporter based assay
In DepthDetails ArticlePubMed