BDBM50382423 CHEMBL2022966
SMILES CN1CCN(Cc2ccc(Nc3ncc(C)c(Nc4ccc(F)c(Cl)c4)n3)cc2)CC1
InChI Key InChIKey=WJLWVXDGXZCYGK-UHFFFAOYSA-N
Data  1 IC50
  Tab Delimited (TSV)   2D SDfile   Computed 3D by Vconf -m prep SDfile
Find this compound or compounds like it in BindingDB:
Activity Spreadsheet -- Enzyme Inhibition Constant Data from BindingDB
Found 1 hit for monomerid = 50382423
TargetTyrosine-protein kinase receptor UFO(Homo sapiens (Human))
TBA
Curated by ChEMBL
LigandPNGBDBM50382423(CHEMBL2022966)
Affinity DataIC50:  6.27E+4nM. Assay description: Inhibition of human recombinant His-tagged AXL kinase using fluorescein-labelled poly-GT as substrate after 60 mins by TR-FRET analysis
In DepthDetails ArticlePubMed