BDBM50382733 CHEMBL2024289
SMILES CC[C@@H](C)[C@@H](N(C)C)C(=O)O[C@H](C(C)C)C(=O)N[C@@H](Cc1ccc(O)cc1)C(=O)N[C@@H](CO)C(=O)N[C@@H](CC(C)C)[C@H](O)CC(=O)N[C@@H](C(C)C)C(=O)NCC(=O)N(C)[C@H](Cc1ccccc1)C(=O)N1CCC[C@H]1C(=O)OC
InChI Key InChIKey=NDLHEZRABDBDPY-YQLRASQXSA-N
Data  1 IC50
  Tab Delimited (TSV)   2D SDfile   Computed 3D by Vconf -m prep SDfile
Find this compound or compounds like it in BindingDB:
Activity Spreadsheet -- Enzyme Inhibition Constant Data from BindingDB
Found 1 hit for monomerid = 50382733
TargetCathepsin E(Homo sapiens (Human))
University Of California
Curated by ChEMBL
LigandPNGBDBM50382733(CHEMBL2024289)
Affinity DataIC50:  0.300nM. Assay description: Inhibition of cathepsin E
In DepthDetails ArticlePubMed